Workaround, inline ESV file contents:

module Analysis

//imports
//
//  nabl2/Menus
//  nabl2/References

language

  observer : editor-analyze (constraint)
  context  : scopegraph

  
  
references

  reference _ : editor-resolve
  hover _     : editor-hover
  
  
menus

  menu: "Analysis"

    action: "Show File Analysis"                        = show-file-analysis (meta) (realtime) (openeditor)
    action: "Show File Analysis ATerm"                  = show-file-analysis-aterm (meta) (realtime) (openeditor)
    action: "Show File Uninterpreted Constraints ATerm" = show-file-uninterpreted-constraints-aterm (meta) (realtime) (openeditor)

    separator

    action: "Show Project Analysis"                        = show-project-analysis (meta) (realtime) (openeditor)
    action: "Show Project Analysis ATerm"                  = show-project-analysis-aterm (meta) (realtime) (openeditor)
    action: "Show Project Uninterpreted Constraints ATerm" = show-project-uninterpreted-constraints-aterm (meta) (realtime) (openeditor)

Version:

Eclipse: org.eclipse.platform.ide 4.6.0.I20160606-1100
Spoofax: org.metaborg.spoofax.eclipse 2.1.0.20160909-181911-master
System: Windows 10 amd64 10.0

(No issue on OS X, but that might still have cached a version of the dependency that works)

Stack trace:

20:20 | ERROR | .m.s.m.c.b.LanguageSpecBuilder - ERROR in eclipse:///icedust2
20:20 | ERROR | .m.s.m.c.b.LanguageSpecBuilder - Transformation failed unexpectedly
20:20 | ERROR | .m.s.m.c.b.LanguageSpecBuilder - 	Caused by:
20:20 | ERROR | .m.s.m.c.b.LanguageSpecBuilder - org.metaborg.core.transform.TransformException: Invoking Stratego strategy failed unexpectedly:
20:20 | ERROR | .m.s.m.c.b.LanguageSpecBuilder - Stratego trace:
20:20 | ERROR | .m.s.m.c.b.LanguageSpecBuilder - 	pack_main_descriptor_file_0_0
20:20 | ERROR | .m.s.m.c.b.LanguageSpecBuilder - 	pack_main_descriptor_file_0_0
20:20 | ERROR | .m.s.m.c.b.LanguageSpecBuilder - 	create_packed_descriptor_1_0
20:20 | ERROR | .m.s.m.c.b.LanguageSpecBuilder - 	Module_3_0
20:20 | ERROR | .m.s.m.c.b.LanguageSpecBuilder - 	read_definitions_0_0
20:20 | ERROR | .m.s.m.c.b.LanguageSpecBuilder - 	map_1_0
20:20 | ERROR | .m.s.m.c.b.LanguageSpecBuilder - 	read_definitions_0_0
20:20 | ERROR | .m.s.m.c.b.LanguageSpecBuilder - 	map_1_0
20:20 | ERROR | .m.s.m.c.b.LanguageSpecBuilder - 	read_descriptor_file_0_0
20:20 | ERROR | .m.s.m.c.b.LanguageSpecBuilder - 	find_descriptor_file_0_0
20:20 | ERROR | .m.s.m.c.b.LanguageSpecBuilder - 	resolve_in_path_0_1
20:20 | ERROR | .m.s.m.c.b.LanguageSpecBuilder - 	getfirst_1_0
20:20 | ERROR | .m.s.m.c.b.LanguageSpecBuilder - 	file_exists_0_0
20:20 | ERROR | .m.s.m.c.b.LanguageSpecBuilder - 
20:20 | ERROR | .m.s.m.c.b.LanguageSpecBuilder - 	at org.metaborg.spoofax.core.transform.StrategoTransformer.transform(StrategoTransformer.java:140)
20:20 | ERROR | .m.s.m.c.b.LanguageSpecBuilder - 	at org.metaborg.spoofax.core.transform.StrategoTransformer.transform(StrategoTransformer.java:76)
20:20 | ERROR | .m.s.m.c.b.LanguageSpecBuilder - 	at org.metaborg.spoofax.core.transform.StrategoTransformer.transform(StrategoTransformer.java:1)
20:20 | ERROR | .m.s.m.c.b.LanguageSpecBuilder - 	at org.metaborg.core.transform.TransformService.transform(TransformService.java:90)
20:20 | ERROR | .m.s.m.c.b.LanguageSpecBuilder - 	at org.metaborg.core.transform.TransformService.transform(TransformService.java:78)
20:20 | ERROR | .m.s.m.c.b.LanguageSpecBuilder - 	at org.metaborg.core.build.Builder.transform(Builder.java:426)
20:20 | ERROR | .m.s.m.c.b.LanguageSpecBuilder - 	at org.metaborg.core.build.Builder.updateLanguageResources(Builder.java:266)
20:20 | ERROR | .m.s.m.c.b.LanguageSpecBuilder - 	at org.metaborg.core.build.Builder.build(Builder.java:188)
20:20 | ERROR | .m.s.m.c.b.LanguageSpecBuilder - 	at org.metaborg.spoofax.eclipse.build.BuildRunnable.run(BuildRunnable.java:61)
20:20 | ERROR | .m.s.m.c.b.LanguageSpecBuilder - 	at org.eclipse.core.internal.resources.Workspace.run(Workspace.java:2240)
20:20 | ERROR | .m.s.m.c.b.LanguageSpecBuilder - 	at org.eclipse.core.internal.resources.Workspace.run(Workspace.java:2267)
20:20 | ERROR | .m.s.m.c.b.LanguageSpecBuilder - 	at org.metaborg.spoofax.eclipse.processing.RunnableTask.schedule(RunnableTask.java:45)
20:20 | ERROR | .m.s.m.c.b.LanguageSpecBuilder - 	at org.metaborg.spoofax.meta.core.build.LanguageSpecBuilder.compile(LanguageSpecBuilder.java:162)
20:20 | ERROR | .m.s.m.c.b.LanguageSpecBuilder - 	at org.metaborg.spoofax.eclipse.meta.build.CompileBuilder$1.run(CompileBuilder.java:49)
20:20 | ERROR | .m.s.m.c.b.LanguageSpecBuilder - 	at org.eclipse.core.internal.resources.Workspace.run(Workspace.java:2240)
20:20 | ERROR | .m.s.m.c.b.LanguageSpecBuilder - 	at org.eclipse.core.internal.resources.Workspace.run(Workspace.java:2267)
20:20 | ERROR | .m.s.m.c.b.LanguageSpecBuilder - 	at org.metaborg.spoofax.eclipse.meta.build.CompileBuilder.build(CompileBuilder.java:69)
20:20 | ERROR | .m.s.m.c.b.LanguageSpecBuilder - 	at org.metaborg.spoofax.eclipse.meta.build.Builder.build(Builder.java:53)
20:20 | ERROR | .m.s.m.c.b.LanguageSpecBuilder - 	at org.eclipse.core.internal.events.BuildManager$2.run(BuildManager.java:735)
20:20 | ERROR | .m.s.m.c.b.LanguageSpecBuilder - 	at org.eclipse.core.runtime.SafeRunner.run(SafeRunner.java:42)
20:20 | ERROR | .m.s.m.c.b.LanguageSpecBuilder - 	at org.eclipse.core.internal.events.BuildManager.basicBuild(BuildManager.java:206)
20:20 | ERROR | .m.s.m.c.b.LanguageSpecBuilder - 	at org.eclipse.core.internal.events.BuildManager.basicBuild(BuildManager.java:246)
20:20 | ERROR | .m.s.m.c.b.LanguageSpecBuilder - 	at org.eclipse.core.internal.events.BuildManager$1.run(BuildManager.java:301)
20:20 | ERROR | .m.s.m.c.b.LanguageSpecBuilder - 	at org.eclipse.core.runtime.SafeRunner.run(SafeRunner.java:42)
20:20 | ERROR | .m.s.m.c.b.LanguageSpecBuilder - 	at org.eclipse.core.internal.events.BuildManager.basicBuild(BuildManager.java:304)
20:20 | ERROR | .m.s.m.c.b.LanguageSpecBuilder - 	at org.eclipse.core.internal.events.BuildManager.basicBuildLoop(BuildManager.java:360)
20:20 | ERROR | .m.s.m.c.b.LanguageSpecBuilder - 	at org.eclipse.core.internal.events.BuildManager.build(BuildManager.java:383)
20:20 | ERROR | .m.s.m.c.b.LanguageSpecBuilder - 	at org.eclipse.core.internal.resources.Workspace.buildInternal(Workspace.java:487)
20:20 | ERROR | .m.s.m.c.b.LanguageSpecBuilder - 	at org.eclipse.core.internal.resources.Workspace.build(Workspace.java:406)
20:20 | ERROR | .m.s.m.c.b.LanguageSpecBuilder - 	at org.eclipse.ui.actions.BuildAction$1.runInWorkspace(BuildAction.java:285)
20:20 | ERROR | .m.s.m.c.b.LanguageSpecBuilder - 	at org.eclipse.core.internal.resources.InternalWorkspaceJob.run(InternalWorkspaceJob.java:39)
20:20 | ERROR | .m.s.m.c.b.LanguageSpecBuilder - 	at org.eclipse.core.internal.jobs.Worker.run(Worker.java:55)
20:20 | ERROR | .m.s.m.c.b.LanguageSpecBuilder - Caused by: org.spoofax.interpreter.core.InterpreterException: Exception during evaluation
20:20 | ERROR | .m.s.m.c.b.LanguageSpecBuilder - 	at org.spoofax.interpreter.core.Interpreter.evaluate(Interpreter.java:120)
20:20 | ERROR | .m.s.m.c.b.LanguageSpecBuilder - 	at org.spoofax.interpreter.core.Interpreter.invoke(Interpreter.java:82)
20:20 | ERROR | .m.s.m.c.b.LanguageSpecBuilder - 	at org.strategoxt.HybridInterpreter.invoke(HybridInterpreter.java:442)
20:20 | ERROR | .m.s.m.c.b.LanguageSpecBuilder - 	at org.metaborg.spoofax.core.stratego.StrategoCommon.invoke(StrategoCommon.java:93)
20:20 | ERROR | .m.s.m.c.b.LanguageSpecBuilder - 	at org.metaborg.spoofax.core.transform.StrategoTransformer.transform(StrategoTransformer.java:138)
20:20 | ERROR | .m.s.m.c.b.LanguageSpecBuilder - 	... 31 more
20:20 | ERROR | .m.s.m.c.b.LanguageSpecBuilder - Caused by: org.strategoxt.lang.StrategoException: Exception in execution of primitive 'SSL_access'
20:20 | ERROR | .m.s.m.c.b.LanguageSpecBuilder - 	at org.strategoxt.lang.Context.invokePrimitive(Context.java:240)
20:20 | ERROR | .m.s.m.c.b.LanguageSpecBuilder - 	at org.strategoxt.lang.Context.invokePrimitive(Context.java:216)
20:20 | ERROR | .m.s.m.c.b.LanguageSpecBuilder - 	at org.strategoxt.stratego_lib.access_0_0.invoke(access_0_0.java:28)
20:20 | ERROR | .m.s.m.c.b.LanguageSpecBuilder - 	at org.strategoxt.stratego_lib.file_exists_0_0.invoke(file_exists_0_0.java:25)
20:20 | ERROR | .m.s.m.c.b.LanguageSpecBuilder - 	at org.metaborg.meta.lang.esv.trans.lifted32.invoke(lifted32.java:52)
20:20 | ERROR | .m.s.m.c.b.LanguageSpecBuilder - 	at org.strategoxt.lang.compat.override.performance_tweaks.lifted6967.invoke(lifted6967.java:24)
20:20 | ERROR | .m.s.m.c.b.LanguageSpecBuilder - 	at org.strategoxt.lang.SRTS_one.fetchMaintainAnnos(SRTS_one.java:57)
20:20 | ERROR | .m.s.m.c.b.LanguageSpecBuilder - 	at org.strategoxt.lang.SRTS_one.fetchMaintainAnnos(SRTS_one.java:60)
20:20 | ERROR | .m.s.m.c.b.LanguageSpecBuilder - 	at org.strategoxt.lang.SRTS_one.fetchMaintainAnnos(SRTS_one.java:60)
20:20 | ERROR | .m.s.m.c.b.LanguageSpecBuilder - 	at org.strategoxt.lang.SRTS_one.fetchMaintainAnnos(SRTS_one.java:60)
20:20 | ERROR | .m.s.m.c.b.LanguageSpecBuilder - 	at org.strategoxt.lang.SRTS_one.fetchMaintainAnnos(SRTS_one.java:60)
20:20 | ERROR | .m.s.m.c.b.LanguageSpecBuilder - 	at org.strategoxt.lang.SRTS_one.invoke(SRTS_one.java:21)
20:20 | ERROR | .m.s.m.c.b.LanguageSpecBuilder - 	at org.strategoxt.lang.compat.override.performance_tweaks.getfirst_1_0_override.invoke(getfirst_1_0_override.java:27)
20:20 | ERROR | .m.s.m.c.b.LanguageSpecBuilder - 	at org.metaborg.meta.lang.esv.trans.resolve_in_path_0_1.invoke(resolve_in_path_0_1.java:39)
20:20 | ERROR | .m.s.m.c.b.LanguageSpecBuilder - 	at org.metaborg.meta.lang.esv.trans.find_descriptor_file_0_0.invoke(find_descriptor_file_0_0.java:58)
20:20 | ERROR | .m.s.m.c.b.LanguageSpecBuilder - 	at org.metaborg.meta.lang.esv.trans.read_descriptor_file_0_0.invoke(read_descriptor_file_0_0.java:36)
20:20 | ERROR | .m.s.m.c.b.LanguageSpecBuilder - 	at org.metaborg.meta.lang.esv.trans.lifted25.invoke(lifted25.java:27)
20:20 | ERROR | .m.s.m.c.b.LanguageSpecBuilder - 	at org.strategoxt.lang.SRTS_all.map(SRTS_all.java:60)
20:20 | ERROR | .m.s.m.c.b.LanguageSpecBuilder - 	at org.strategoxt.lang.SRTS_all.invoke(SRTS_all.java:21)
20:20 | ERROR | .m.s.m.c.b.LanguageSpecBuilder - 	at org.strategoxt.lang.compat.override.performance_tweaks.map_1_0_override.invoke(map_1_0_override.java:29)
20:20 | ERROR | .m.s.m.c.b.LanguageSpecBuilder - 	at org.metaborg.meta.lang.esv.trans.read_definitions_0_0.invoke(read_definitions_0_0.java:72)
20:20 | ERROR | .m.s.m.c.b.LanguageSpecBuilder - 	at org.metaborg.meta.lang.esv.trans.lifted25.invoke(lifted25.java:30)
20:20 | ERROR | .m.s.m.c.b.LanguageSpecBuilder - 	at org.strategoxt.lang.SRTS_all.mapIgnoreAnnos(SRTS_all.java:109)
20:20 | ERROR | .m.s.m.c.b.LanguageSpecBuilder - 	at org.strategoxt.lang.SRTS_all.map(SRTS_all.java:77)
20:20 | ERROR | .m.s.m.c.b.LanguageSpecBuilder - 	at org.strategoxt.lang.SRTS_all.invoke(SRTS_all.java:21)
20:20 | ERROR | .m.s.m.c.b.LanguageSpecBuilder - 	at org.strategoxt.lang.compat.override.performance_tweaks.map_1_0_override.invoke(map_1_0_override.java:29)
20:20 | ERROR | .m.s.m.c.b.LanguageSpecBuilder - 	at org.metaborg.meta.lang.esv.trans.read_definitions_0_0.invoke(read_definitions_0_0.java:72)
20:20 | ERROR | .m.s.m.c.b.LanguageSpecBuilder - 	at org.metaborg.meta.lang.esv.trans.lifted21.invoke(lifted21.java:29)
20:20 | ERROR | .m.s.m.c.b.LanguageSpecBuilder - 	at org.metaborg.meta.lang.esv.trans.$Module_3_0.invoke($Module_3_0.java:50)
20:20 | ERROR | .m.s.m.c.b.LanguageSpecBuilder - 	at org.metaborg.meta.lang.esv.trans.create_packed_descriptor_1_0.invoke(create_packed_descriptor_1_0.java:28)
20:20 | ERROR | .m.s.m.c.b.LanguageSpecBuilder - 	at org.metaborg.meta.lang.esv.trans.pack_main_descriptor_file_0_0.invoke(pack_main_descriptor_file_0_0.java:64)
20:20 | ERROR | .m.s.m.c.b.LanguageSpecBuilder - 	at org.strategoxt.lang.Strategy.invokeDynamic(Strategy.java:30)
20:20 | ERROR | .m.s.m.c.b.LanguageSpecBuilder - 	at org.strategoxt.lang.InteropSDefT.evaluate(InteropSDefT.java:192)
20:20 | ERROR | .m.s.m.c.b.LanguageSpecBuilder - 	at org.strategoxt.lang.InteropSDefT.evaluate(InteropSDefT.java:183)
20:20 | ERROR | .m.s.m.c.b.LanguageSpecBuilder - 	at org.strategoxt.lang.InteropSDefT$StrategyBody.evaluate(InteropSDefT.java:245)
20:20 | ERROR | .m.s.m.c.b.LanguageSpecBuilder - 	at org.spoofax.interpreter.core.Interpreter.evaluate(Interpreter.java:109)
20:20 | ERROR | .m.s.m.c.b.LanguageSpecBuilder - 	... 35 more
20:20 | ERROR | .m.s.m.c.b.LanguageSpecBuilder - Caused by: org.metaborg.core.MetaborgRuntimeException: org.apache.commons.vfs2.FileSystemException: Incorrect file system URI "file:///C:/" in name "file:///C:/Program Files Custom/spoofax-win32-x86_64-20160909/plugins/meta.lib.spoofax.eclipse_2.1.0.20160909-181911-master/target/unpacked/latest/editor/nabl2/References.esv", was expecting "eclipse:///".
20:20 | ERROR | .m.s.m.c.b.LanguageSpecBuilder - 	at org.metaborg.core.resource.ResourceService.resolve(ResourceService.java:119)
20:20 | ERROR | .m.s.m.c.b.LanguageSpecBuilder - 	at org.metaborg.spoofax.core.stratego.ResourceAgent.exists(ResourceAgent.java:384)
20:20 | ERROR | .m.s.m.c.b.LanguageSpecBuilder - 	at org.spoofax.interpreter.library.ssl.SSL_access.call(SSL_access.java:58)
20:20 | ERROR | .m.s.m.c.b.LanguageSpecBuilder - 	at org.strategoxt.lang.Context.invokePrimitive(Context.java:227)
20:20 | ERROR | .m.s.m.c.b.LanguageSpecBuilder - 	... 70 more
20:20 | ERROR | .m.s.m.c.b.LanguageSpecBuilder - Caused by: org.apache.commons.vfs2.FileSystemException: Incorrect file system URI "file:///C:/" in name "file:///C:/Program Files Custom/spoofax-win32-x86_64-20160909/plugins/meta.lib.spoofax.eclipse_2.1.0.20160909-181911-master/target/unpacked/latest/editor/nabl2/References.esv", was expecting "eclipse:///".
20:20 | ERROR | .m.s.m.c.b.LanguageSpecBuilder - 	at org.apache.commons.vfs2.provider.AbstractFileSystem.resolveFile(AbstractFileSystem.java:324)
20:20 | ERROR | .m.s.m.c.b.LanguageSpecBuilder - 	at org.apache.commons.vfs2.provider.AbstractFileSystem.resolveFile(AbstractFileSystem.java:317)
20:20 | ERROR | .m.s.m.c.b.LanguageSpecBuilder - 	at org.apache.commons.vfs2.provider.AbstractFileObject.resolveFile(AbstractFileObject.java:2024)
20:20 | ERROR | .m.s.m.c.b.LanguageSpecBuilder - 	at org.metaborg.core.resource.ResourceService.resolve(ResourceService.java:117)
20:20 | ERROR | .m.s.m.c.b.LanguageSpecBuilder - 	... 73 more
20:20 | ERROR | .m.s.m.c.b.LanguageSpecBuilder - 
20:20 | ERROR | .m.s.m.c.b.LanguageSpecBuilder - 
20:20 | INFO  | .m.s.m.c.b.LanguageSpecBuilder - 2 messages (1 exception, 1 error, 0 warnings, 0 notes)
20:20 | ERROR | o.m.s.e.m.b.CompileBuilder     - Compiling Main ESV file failed
20:20 | ERROR | o.m.s.e.m.b.CompileBuilder     - BUILD FAILED
Submitted by Daco Harkes on 11 September 2016 at 20:27

On 11 September 2016 at 20:52 Daco Harkes commented:

All stratego analysis fail as well, with the same stratego stacktrace file_exists_0_0.

20:51 | ERROR | o.m.s.e.e.EditorUpdateJob      - Failed to update editor for eclipse:///icedust2/trans/pp.str
org.metaborg.core.analysis.AnalysisException: Analysis for eclipse:///icedust2/trans/pp.str failed
	at org.metaborg.spoofax.core.analysis.legacy.StrategoAnalyzer.analyze(StrategoAnalyzer.java:203) ~[org.metaborg.spoofax.core_2.1.0.20160909-181911-master.jar:na]
	at org.metaborg.spoofax.core.analysis.legacy.StrategoAnalyzer.analyze(StrategoAnalyzer.java:99) ~[org.metaborg.spoofax.core_2.1.0.20160909-181911-master.jar:na]
	at org.metaborg.spoofax.core.analysis.legacy.StrategoAnalyzer.analyze(StrategoAnalyzer.java:1) ~[org.metaborg.spoofax.core_2.1.0.20160909-181911-master.jar:na]
	at org.metaborg.core.analysis.AnalysisService.analyze(AnalysisService.java:27) ~[org.metaborg.core_2.1.0.20160909-181911-master.jar:na]
	at org.metaborg.spoofax.core.analysis.SpoofaxAnalysisService.analyze(SpoofaxAnalysisService.java:17) ~[org.metaborg.spoofax.core_2.1.0.20160909-181911-master.jar:na]
	at org.metaborg.spoofax.core.analysis.SpoofaxAnalysisService.analyze(SpoofaxAnalysisService.java:1) ~[org.metaborg.spoofax.core_2.1.0.20160909-181911-master.jar:na]
	at org.metaborg.spoofax.eclipse.editor.EditorUpdateJob.analyze(EditorUpdateJob.java:349) ~[org.metaborg.spoofax.eclipse_2.1.0.20160909-181911-master.jar:na]
	at org.metaborg.spoofax.eclipse.editor.EditorUpdateJob.update(EditorUpdateJob.java:277) ~[org.metaborg.spoofax.eclipse_2.1.0.20160909-181911-master.jar:na]
	at org.metaborg.spoofax.eclipse.editor.EditorUpdateJob.run(EditorUpdateJob.java:130) ~[org.metaborg.spoofax.eclipse_2.1.0.20160909-181911-master.jar:na]
	at org.eclipse.core.internal.jobs.Worker.run(Worker.java:55) [org.eclipse.core.jobs_3.8.0.v20160509-0411.jar:na]
Caused by: org.metaborg.core.MetaborgException: Invoking Stratego strategy failed unexpectedly:
Stratego trace:
	editor_analyze_0_0
	editor_analyze_0_0
	analyze_ast_0_0
	declare_globals_top_0_0
	alltd_1_0
	origin_track_forced_1_0
	declare_globals_0_0
	open_wildcard_import_4_0
	resolve_import_path_0_0
	fetch_elem_1_0
	file_exists_0_0

	at org.metaborg.spoofax.core.stratego.StrategoCommon.handleException(StrategoCommon.java:154) ~[org.metaborg.spoofax.core_2.1.0.20160909-181911-master.jar:na]
	at org.metaborg.spoofax.core.stratego.StrategoCommon.invoke(StrategoCommon.java:99) ~[org.metaborg.spoofax.core_2.1.0.20160909-181911-master.jar:na]
	at org.metaborg.spoofax.core.analysis.legacy.StrategoAnalyzer.analyze(StrategoAnalyzer.java:179) ~[org.metaborg.spoofax.core_2.1.0.20160909-181911-master.jar:na]
	... 9 common frames omitted
Caused by: org.spoofax.interpreter.core.InterpreterException: Exception during evaluation
	at org.spoofax.interpreter.core.Interpreter.evaluate(Interpreter.java:120) ~[org.spoofax.interpreter.core_2.1.0.20160909-181911-master.jar:na]
	at org.spoofax.interpreter.core.Interpreter.invoke(Interpreter.java:82) ~[org.spoofax.interpreter.core_2.1.0.20160909-181911-master.jar:na]
	at org.strategoxt.HybridInterpreter.invoke(HybridInterpreter.java:442) ~[org.strategoxt.strj_2.1.0.20160909-181911-master/:na]
	at org.metaborg.spoofax.core.stratego.StrategoCommon.invoke(StrategoCommon.java:93) ~[org.metaborg.spoofax.core_2.1.0.20160909-181911-master.jar:na]
	... 10 common frames omitted
Caused by: org.strategoxt.lang.StrategoException: Exception in execution of primitive 'SSL_access'
	at org.strategoxt.lang.Context.invokePrimitive(Context.java:240) ~[org.strategoxt.strj_2.1.0.20160909-181911-master/:na]
	at org.strategoxt.lang.Context.invokePrimitive(Context.java:216) ~[org.strategoxt.strj_2.1.0.20160909-181911-master/:na]
	at org.strategoxt.stratego_lib.access_0_0.invoke(access_0_0.java:28) ~[strategoxt-min-jar-2.1.0-SNAPSHOT.jar:na]
	at org.strategoxt.stratego_lib.file_exists_0_0.invoke(file_exists_0_0.java:25) ~[strategoxt-min-jar-2.1.0-SNAPSHOT.jar:na]
	at org.metaborg.meta.lang.stratego.trans.lifted103.invoke(lifted103.java:50) ~[na:na]
	at org.strategoxt.lang.compat.override.performance_tweaks.lifted6969.invoke(lifted6969.java:24) ~[strategoxt-min-jar-2.1.0-SNAPSHOT.jar:na]
	at org.strategoxt.lang.SRTS_one.fetchMaintainAnnos(SRTS_one.java:57) ~[org.strategoxt.strj_2.1.0.20160909-181911-master/:na]
	at org.strategoxt.lang.SRTS_one.fetchMaintainAnnos(SRTS_one.java:60) ~[org.strategoxt.strj_2.1.0.20160909-181911-master/:na]
	at org.strategoxt.lang.SRTS_one.fetchMaintainAnnos(SRTS_one.java:60) ~[org.strategoxt.strj_2.1.0.20160909-181911-master/:na]
	at org.strategoxt.lang.SRTS_one.fetchMaintainAnnos(SRTS_one.java:60) ~[org.strategoxt.strj_2.1.0.20160909-181911-master/:na]
	at org.strategoxt.lang.SRTS_one.fetchMaintainAnnos(SRTS_one.java:60) ~[org.strategoxt.strj_2.1.0.20160909-181911-master/:na]
	at org.strategoxt.lang.SRTS_one.fetchMaintainAnnos(SRTS_one.java:60) ~[org.strategoxt.strj_2.1.0.20160909-181911-master/:na]
	at org.strategoxt.lang.SRTS_one.invoke(SRTS_one.java:21) ~[org.strategoxt.strj_2.1.0.20160909-181911-master/:na]
	at org.strategoxt.lang.compat.override.performance_tweaks.fetch_elem_1_0_override.invoke(fetch_elem_1_0_override.java:27) ~[strategoxt-min-jar-2.1.0-SNAPSHOT.jar:na]
	at org.metaborg.meta.lang.stratego.trans.resolve_import_path_0_0.invoke(resolve_import_path_0_0.java:42) ~[na:na]
	at org.metaborg.meta.lang.stratego.trans.open_wildcard_import_4_0.invoke(open_wildcard_import_4_0.java:32) ~[na:na]
	at org.metaborg.meta.lang.stratego.trans.declare_globals_0_0.invoke(declare_globals_0_0.java:401) ~[na:na]
	at org.strategoxt.lang.SRTS_all.map(SRTS_all.java:60) ~[org.strategoxt.strj_2.1.0.20160909-181911-master/:na]
	at org.strategoxt.lang.SRTS_all.invoke(SRTS_all.java:21) ~[org.strategoxt.strj_2.1.0.20160909-181911-master/:na]
	at org.metaborg.meta.lang.stratego.trans.origin_track_forced_1_0.invoke(origin_track_forced_1_0.java:31) ~[na:na]
	at org.metaborg.meta.lang.stratego.trans.lifted92.invoke(lifted92.java:27) ~[na:na]
	at org.strategoxt.stratego_lib.p_1174.invoke(p_1174.java:27) ~[strategoxt-min-jar-2.1.0-SNAPSHOT.jar:na]
	at org.strategoxt.lang.SRTS_all.mapMaintainAnnos(SRTS_all.java:124) ~[org.strategoxt.strj_2.1.0.20160909-181911-master/:na]
	at org.strategoxt.lang.SRTS_all.map(SRTS_all.java:68) ~[org.strategoxt.strj_2.1.0.20160909-181911-master/:na]
	at org.strategoxt.lang.SRTS_all.invoke(SRTS_all.java:21) ~[org.strategoxt.strj_2.1.0.20160909-181911-master/:na]
	at org.strategoxt.stratego_lib.p_1174.invoke(p_1174.java:33) ~[strategoxt-min-jar-2.1.0-SNAPSHOT.jar:na]
	at org.strategoxt.lang.SRTS_all.invoke(SRTS_all.java:28) ~[org.strategoxt.strj_2.1.0.20160909-181911-master/:na]
	at org.strategoxt.stratego_lib.p_1174.invoke(p_1174.java:33) ~[strategoxt-min-jar-2.1.0-SNAPSHOT.jar:na]
	at org.strategoxt.lang.SRTS_all.map(SRTS_all.java:60) ~[org.strategoxt.strj_2.1.0.20160909-181911-master/:na]
	at org.strategoxt.lang.SRTS_all.invoke(SRTS_all.java:21) ~[org.strategoxt.strj_2.1.0.20160909-181911-master/:na]
	at org.strategoxt.stratego_lib.p_1174.invoke(p_1174.java:33) ~[strategoxt-min-jar-2.1.0-SNAPSHOT.jar:na]
	at org.strategoxt.lang.SRTS_all.invoke(SRTS_all.java:28) ~[org.strategoxt.strj_2.1.0.20160909-181911-master/:na]
	at org.strategoxt.stratego_lib.p_1174.invoke(p_1174.java:33) ~[strategoxt-min-jar-2.1.0-SNAPSHOT.jar:na]
	at org.strategoxt.stratego_lib.alltd_1_0.invoke(alltd_1_0.java:25) ~[strategoxt-min-jar-2.1.0-SNAPSHOT.jar:na]
	at org.metaborg.meta.lang.stratego.trans.declare_globals_top_0_0.invoke(declare_globals_top_0_0.java:74) ~[na:na]
	at org.metaborg.meta.lang.stratego.trans.analyze_ast_0_0.invoke(analyze_ast_0_0.java:238) ~[na:na]
	at org.metaborg.meta.lang.stratego.trans.editor_analyze_0_0.invoke(editor_analyze_0_0.java:76) ~[na:na]
	at org.strategoxt.lang.Strategy.invokeDynamic(Strategy.java:30) ~[org.strategoxt.strj_2.1.0.20160909-181911-master/:na]
	at org.strategoxt.lang.InteropSDefT.evaluate(InteropSDefT.java:192) ~[org.strategoxt.strj_2.1.0.20160909-181911-master/:na]
	at org.strategoxt.lang.InteropSDefT.evaluate(InteropSDefT.java:183) ~[org.strategoxt.strj_2.1.0.20160909-181911-master/:na]
	at org.strategoxt.lang.InteropSDefT$StrategyBody.evaluate(InteropSDefT.java:245) ~[org.strategoxt.strj_2.1.0.20160909-181911-master/:na]
	at org.spoofax.interpreter.core.Interpreter.evaluate(Interpreter.java:109) ~[org.spoofax.interpreter.core_2.1.0.20160909-181911-master.jar:na]
	... 13 common frames omitted
Caused by: org.metaborg.core.MetaborgRuntimeException: org.apache.commons.vfs2.FileSystemException: Incorrect file system URI "file:///C:/" in name "file:///C:/Program Files Custom/spoofax-win32-x86_64-20160909/plugins/meta.lib.spoofax.eclipse_2.1.0.20160909-181911-master/target/unpacked/latest/trans/runtime/refactoring", was expecting "eclipse:///".
	at org.metaborg.core.resource.ResourceService.resolve(ResourceService.java:119) ~[org.metaborg.core_2.1.0.20160909-181911-master.jar:na]
	at org.metaborg.spoofax.core.stratego.ResourceAgent.exists(ResourceAgent.java:384) ~[org.metaborg.spoofax.core_2.1.0.20160909-181911-master.jar:na]
	at org.spoofax.interpreter.library.ssl.SSL_access.call(SSL_access.java:58) ~[org.spoofax.interpreter.core_2.1.0.20160909-181911-master.jar:na]
	at org.strategoxt.lang.Context.invokePrimitive(Context.java:227) ~[org.strategoxt.strj_2.1.0.20160909-181911-master/:na]
	... 54 common frames omitted
Caused by: org.apache.commons.vfs2.FileSystemException: Incorrect file system URI "file:///C:/" in name "file:///C:/Program Files Custom/spoofax-win32-x86_64-20160909/plugins/meta.lib.spoofax.eclipse_2.1.0.20160909-181911-master/target/unpacked/latest/trans/runtime/refactoring", was expecting "eclipse:///".
	at org.apache.commons.vfs2.provider.AbstractFileSystem.resolveFile(AbstractFileSystem.java:324) ~[commons-vfs2-2.1.jar:2.1]
	at org.apache.commons.vfs2.provider.AbstractFileSystem.resolveFile(AbstractFileSystem.java:317) ~[commons-vfs2-2.1.jar:2.1]
	at org.apache.commons.vfs2.provider.AbstractFileObject.resolveFile(AbstractFileObject.java:2024) ~[commons-vfs2-2.1.jar:2.1]
	at org.metaborg.core.resource.ResourceService.resolve(ResourceService.java:117) ~[org.metaborg.core_2.1.0.20160909-181911-master.jar:na]
	... 57 common frames omitted

On 13 September 2016 at 13:13 Gabriël Konat tagged eclipse

On 14 September 2016 at 18:34 Daco Harkes commented:

Spoofax build of today has same issue.

Build:

Eclipse: org.eclipse.platform.ide 4.6.0.I20160606-1100
Spoofax: org.metaborg.spoofax.eclipse 2.1.0.20160914-142021-master
System: Windows 10 amd64 10.0

Cause:

18:30 | ERROR | .m.s.m.c.b.LanguageSpecBuilder - Caused by: org.metaborg.core.MetaborgRuntimeException: org.apache.commons.vfs2.FileSystemException: Incorrect file system URI "file:///C:/" in name "file:///C:/Program Files Custom/spoofax-win32-x86_64-20160914/plugins/meta.lib.spoofax.eclipse_2.1.0.20160914-142021-master/target/unpacked/latest/editor/nabl2/Menus.esv", was expecting "eclipse:///".

Full trace:

18:30 | INFO  | s.e.m.b.GenerateSourcesBuilder - Generating sources for language project eclipse:///icedust2
18:30 | INFO  | o.m.c.build.Builder            - Building eclipse:///icedust2
18:30 | INFO  | o.m.c.build.Builder            - Building 1 sources, 0 includes of language impl. org.metaborg:org.metaborg.meta.lang.esv:2.1.0-SNAPSHOT
18:30 | INFO  | o.m.s.e.m.b.CompileBuilder     - Building language project eclipse:///icedust2
18:30 | INFO  | .m.s.m.c.b.LanguageSpecBuilder - Compiling Main ESV file eclipse:///icedust2/editor/Main.esv
18:30 | INFO  | o.m.c.build.Builder            - Building eclipse:///icedust2
18:30 | INFO  | o.m.c.build.Builder            - Building 1 sources, 42 includes of language impl. org.metaborg:org.metaborg.meta.lang.esv:2.1.0-SNAPSHOT
18:30 | ERROR | o.m.c.build.Builder            - Transformation failed unexpectedly for eclipse:///icedust2/editor/Main.esv
org.metaborg.core.transform.TransformException: Invoking Stratego strategy failed unexpectedly:
Stratego trace:
	pack_main_descriptor_file_0_0
	pack_main_descriptor_file_0_0
	create_packed_descriptor_1_0
	Module_3_0
	read_definitions_0_0
	map_1_0
	read_definitions_0_0
	map_1_0
	read_descriptor_file_0_0
	find_descriptor_file_0_0
	resolve_in_path_0_1
	getfirst_1_0
	file_exists_0_0

	at org.metaborg.spoofax.core.transform.StrategoTransformer.transform(StrategoTransformer.java:140) ~[org.metaborg.spoofax.core_2.1.0.20160914-142021-master.jar:na]
	at org.metaborg.spoofax.core.transform.StrategoTransformer.transform(StrategoTransformer.java:76) ~[org.metaborg.spoofax.core_2.1.0.20160914-142021-master.jar:na]
	at org.metaborg.spoofax.core.transform.StrategoTransformer.transform(StrategoTransformer.java:1) ~[org.metaborg.spoofax.core_2.1.0.20160914-142021-master.jar:na]
	at org.metaborg.core.transform.TransformService.transform(TransformService.java:90) ~[org.metaborg.core_2.1.0.20160914-142021-master.jar:na]
	at org.metaborg.core.transform.TransformService.transform(TransformService.java:78) ~[org.metaborg.core_2.1.0.20160914-142021-master.jar:na]
	at org.metaborg.core.build.Builder.transform(Builder.java:426) [org.metaborg.core_2.1.0.20160914-142021-master.jar:na]
	at org.metaborg.core.build.Builder.updateLanguageResources(Builder.java:266) [org.metaborg.core_2.1.0.20160914-142021-master.jar:na]
	at org.metaborg.core.build.Builder.build(Builder.java:188) [org.metaborg.core_2.1.0.20160914-142021-master.jar:na]
	at org.metaborg.spoofax.eclipse.build.BuildRunnable.run(BuildRunnable.java:61) [org.metaborg.spoofax.eclipse_2.1.0.20160914-142021-master.jar:na]
	at org.eclipse.core.internal.resources.Workspace.run(Workspace.java:2240) [org.eclipse.core.resources_3.11.0.v20160503-1608.jar:na]
	at org.eclipse.core.internal.resources.Workspace.run(Workspace.java:2267) [org.eclipse.core.resources_3.11.0.v20160503-1608.jar:na]
	at org.metaborg.spoofax.eclipse.processing.RunnableTask.schedule(RunnableTask.java:45) [org.metaborg.spoofax.eclipse_2.1.0.20160914-142021-master.jar:na]
	at org.metaborg.spoofax.meta.core.build.LanguageSpecBuilder.compile(LanguageSpecBuilder.java:163) [org.metaborg.spoofax.meta.core_2.1.0.20160914-142021-master.jar:na]
	at org.metaborg.spoofax.eclipse.meta.build.CompileBuilder$1.run(CompileBuilder.java:49) [org.metaborg.spoofax.eclipse.meta_2.1.0.20160914-142021-master.jar:na]
	at org.eclipse.core.internal.resources.Workspace.run(Workspace.java:2240) [org.eclipse.core.resources_3.11.0.v20160503-1608.jar:na]
	at org.eclipse.core.internal.resources.Workspace.run(Workspace.java:2267) [org.eclipse.core.resources_3.11.0.v20160503-1608.jar:na]
	at org.metaborg.spoofax.eclipse.meta.build.CompileBuilder.build(CompileBuilder.java:69) [org.metaborg.spoofax.eclipse.meta_2.1.0.20160914-142021-master.jar:na]
	at org.metaborg.spoofax.eclipse.meta.build.Builder.build(Builder.java:53) [org.metaborg.spoofax.eclipse.meta_2.1.0.20160914-142021-master.jar:na]
	at org.eclipse.core.internal.events.BuildManager$2.run(BuildManager.java:735) [org.eclipse.core.resources_3.11.0.v20160503-1608.jar:na]
	at org.eclipse.core.runtime.SafeRunner.run(SafeRunner.java:42) [org.eclipse.equinox.common_3.8.0.v20160509-1230.jar:na]
	at org.eclipse.core.internal.events.BuildManager.basicBuild(BuildManager.java:206) [org.eclipse.core.resources_3.11.0.v20160503-1608.jar:na]
	at org.eclipse.core.internal.events.BuildManager.basicBuild(BuildManager.java:246) [org.eclipse.core.resources_3.11.0.v20160503-1608.jar:na]
	at org.eclipse.core.internal.events.BuildManager$1.run(BuildManager.java:301) [org.eclipse.core.resources_3.11.0.v20160503-1608.jar:na]
	at org.eclipse.core.runtime.SafeRunner.run(SafeRunner.java:42) [org.eclipse.equinox.common_3.8.0.v20160509-1230.jar:na]
	at org.eclipse.core.internal.events.BuildManager.basicBuild(BuildManager.java:304) [org.eclipse.core.resources_3.11.0.v20160503-1608.jar:na]
	at org.eclipse.core.internal.events.BuildManager.basicBuildLoop(BuildManager.java:360) [org.eclipse.core.resources_3.11.0.v20160503-1608.jar:na]
	at org.eclipse.core.internal.events.BuildManager.build(BuildManager.java:383) [org.eclipse.core.resources_3.11.0.v20160503-1608.jar:na]
	at org.eclipse.core.internal.resources.Workspace.buildInternal(Workspace.java:487) [org.eclipse.core.resources_3.11.0.v20160503-1608.jar:na]
	at org.eclipse.core.internal.resources.Workspace.build(Workspace.java:406) [org.eclipse.core.resources_3.11.0.v20160503-1608.jar:na]
	at org.eclipse.ui.actions.BuildAction$1.runInWorkspace(BuildAction.java:285) [org.eclipse.ui.ide_3.12.0.v20160601-1609.jar:na]
	at org.eclipse.core.internal.resources.InternalWorkspaceJob.run(InternalWorkspaceJob.java:39) [org.eclipse.core.resources_3.11.0.v20160503-1608.jar:na]
	at org.eclipse.core.internal.jobs.Worker.run(Worker.java:55) [org.eclipse.core.jobs_3.8.0.v20160509-0411.jar:na]
Caused by: org.spoofax.interpreter.core.InterpreterException: Exception during evaluation
	at org.spoofax.interpreter.core.Interpreter.evaluate(Interpreter.java:120) ~[org.spoofax.interpreter.core_2.1.0.20160914-142021-master.jar:na]
	at org.spoofax.interpreter.core.Interpreter.invoke(Interpreter.java:82) ~[org.spoofax.interpreter.core_2.1.0.20160914-142021-master.jar:na]
	at org.strategoxt.HybridInterpreter.invoke(HybridInterpreter.java:442) ~[org.strategoxt.strj_2.1.0.20160914-142021-master/:na]
	at org.metaborg.spoofax.core.stratego.StrategoCommon.invoke(StrategoCommon.java:93) ~[org.metaborg.spoofax.core_2.1.0.20160914-142021-master.jar:na]
	at org.metaborg.spoofax.core.transform.StrategoTransformer.transform(StrategoTransformer.java:138) ~[org.metaborg.spoofax.core_2.1.0.20160914-142021-master.jar:na]
	... 31 common frames omitted
Caused by: org.strategoxt.lang.StrategoException: Exception in execution of primitive 'SSL_access'
	at org.strategoxt.lang.Context.invokePrimitive(Context.java:240) ~[org.strategoxt.strj_2.1.0.20160914-142021-master/:na]
	at org.strategoxt.lang.Context.invokePrimitive(Context.java:216) ~[org.strategoxt.strj_2.1.0.20160914-142021-master/:na]
	at org.strategoxt.stratego_lib.access_0_0.invoke(access_0_0.java:28) ~[strategoxt-min-jar-2.1.0-SNAPSHOT.jar:na]
	at org.strategoxt.stratego_lib.file_exists_0_0.invoke(file_exists_0_0.java:25) ~[strategoxt-min-jar-2.1.0-SNAPSHOT.jar:na]
	at org.metaborg.meta.lang.esv.trans.lifted32.invoke(lifted32.java:52) ~[na:na]
	at org.strategoxt.lang.compat.override.performance_tweaks.lifted6964.invoke(lifted6964.java:24) ~[strategoxt-min-jar-2.1.0-SNAPSHOT.jar:na]
	at org.strategoxt.lang.SRTS_one.fetchMaintainAnnos(SRTS_one.java:57) ~[org.strategoxt.strj_2.1.0.20160914-142021-master/:na]
	at org.strategoxt.lang.SRTS_one.fetchMaintainAnnos(SRTS_one.java:60) ~[org.strategoxt.strj_2.1.0.20160914-142021-master/:na]
	at org.strategoxt.lang.SRTS_one.fetchMaintainAnnos(SRTS_one.java:60) ~[org.strategoxt.strj_2.1.0.20160914-142021-master/:na]
	at org.strategoxt.lang.SRTS_one.fetchMaintainAnnos(SRTS_one.java:60) ~[org.strategoxt.strj_2.1.0.20160914-142021-master/:na]
	at org.strategoxt.lang.SRTS_one.fetchMaintainAnnos(SRTS_one.java:60) ~[org.strategoxt.strj_2.1.0.20160914-142021-master/:na]
	at org.strategoxt.lang.SRTS_one.invoke(SRTS_one.java:21) ~[org.strategoxt.strj_2.1.0.20160914-142021-master/:na]
	at org.strategoxt.lang.compat.override.performance_tweaks.getfirst_1_0_override.invoke(getfirst_1_0_override.java:27) ~[strategoxt-min-jar-2.1.0-SNAPSHOT.jar:na]
	at org.metaborg.meta.lang.esv.trans.resolve_in_path_0_1.invoke(resolve_in_path_0_1.java:39) ~[na:na]
	at org.metaborg.meta.lang.esv.trans.find_descriptor_file_0_0.invoke(find_descriptor_file_0_0.java:58) ~[na:na]
	at org.metaborg.meta.lang.esv.trans.read_descriptor_file_0_0.invoke(read_descriptor_file_0_0.java:36) ~[na:na]
	at org.metaborg.meta.lang.esv.trans.lifted25.invoke(lifted25.java:27) ~[na:na]
	at org.strategoxt.lang.SRTS_all.map(SRTS_all.java:60) ~[org.strategoxt.strj_2.1.0.20160914-142021-master/:na]
	at org.strategoxt.lang.SRTS_all.invoke(SRTS_all.java:21) ~[org.strategoxt.strj_2.1.0.20160914-142021-master/:na]
	at org.strategoxt.lang.compat.override.performance_tweaks.map_1_0_override.invoke(map_1_0_override.java:29) ~[strategoxt-min-jar-2.1.0-SNAPSHOT.jar:na]
	at org.metaborg.meta.lang.esv.trans.read_definitions_0_0.invoke(read_definitions_0_0.java:72) ~[na:na]
	at org.metaborg.meta.lang.esv.trans.lifted25.invoke(lifted25.java:30) ~[na:na]
	at org.strategoxt.lang.SRTS_all.mapIgnoreAnnos(SRTS_all.java:109) ~[org.strategoxt.strj_2.1.0.20160914-142021-master/:na]
	at org.strategoxt.lang.SRTS_all.map(SRTS_all.java:77) ~[org.strategoxt.strj_2.1.0.20160914-142021-master/:na]
	at org.strategoxt.lang.SRTS_all.invoke(SRTS_all.java:21) ~[org.strategoxt.strj_2.1.0.20160914-142021-master/:na]
	at org.strategoxt.lang.compat.override.performance_tweaks.map_1_0_override.invoke(map_1_0_override.java:29) ~[strategoxt-min-jar-2.1.0-SNAPSHOT.jar:na]
	at org.metaborg.meta.lang.esv.trans.read_definitions_0_0.invoke(read_definitions_0_0.java:72) ~[na:na]
	at org.metaborg.meta.lang.esv.trans.lifted21.invoke(lifted21.java:29) ~[na:na]
	at org.metaborg.meta.lang.esv.trans.$Module_3_0.invoke($Module_3_0.java:50) ~[na:na]
	at org.metaborg.meta.lang.esv.trans.create_packed_descriptor_1_0.invoke(create_packed_descriptor_1_0.java:28) ~[na:na]
	at org.metaborg.meta.lang.esv.trans.pack_main_descriptor_file_0_0.invoke(pack_main_descriptor_file_0_0.java:64) ~[na:na]
	at org.strategoxt.lang.Strategy.invokeDynamic(Strategy.java:30) ~[org.strategoxt.strj_2.1.0.20160914-142021-master/:na]
	at org.strategoxt.lang.InteropSDefT.evaluate(InteropSDefT.java:192) ~[org.strategoxt.strj_2.1.0.20160914-142021-master/:na]
	at org.strategoxt.lang.InteropSDefT.evaluate(InteropSDefT.java:183) ~[org.strategoxt.strj_2.1.0.20160914-142021-master/:na]
	at org.strategoxt.lang.InteropSDefT$StrategyBody.evaluate(InteropSDefT.java:245) ~[org.strategoxt.strj_2.1.0.20160914-142021-master/:na]
	at org.spoofax.interpreter.core.Interpreter.evaluate(Interpreter.java:109) ~[org.spoofax.interpreter.core_2.1.0.20160914-142021-master.jar:na]
	... 35 common frames omitted
Caused by: org.metaborg.core.MetaborgRuntimeException: org.apache.commons.vfs2.FileSystemException: Incorrect file system URI "file:///C:/" in name "file:///C:/Program Files Custom/spoofax-win32-x86_64-20160914/plugins/meta.lib.spoofax.eclipse_2.1.0.20160914-142021-master/target/unpacked/latest/editor/nabl2/Menus.esv", was expecting "eclipse:///".
	at org.metaborg.core.resource.ResourceService.resolve(ResourceService.java:119) ~[org.metaborg.core_2.1.0.20160914-142021-master.jar:na]
	at org.metaborg.spoofax.core.stratego.ResourceAgent.exists(ResourceAgent.java:384) ~[org.metaborg.spoofax.core_2.1.0.20160914-142021-master.jar:na]
	at org.spoofax.interpreter.library.ssl.SSL_access.call(SSL_access.java:58) ~[org.spoofax.interpreter.core_2.1.0.20160914-142021-master.jar:na]
	at org.strategoxt.lang.Context.invokePrimitive(Context.java:227) ~[org.strategoxt.strj_2.1.0.20160914-142021-master/:na]
	... 70 common frames omitted
Caused by: org.apache.commons.vfs2.FileSystemException: Incorrect file system URI "file:///C:/" in name "file:///C:/Program Files Custom/spoofax-win32-x86_64-20160914/plugins/meta.lib.spoofax.eclipse_2.1.0.20160914-142021-master/target/unpacked/latest/editor/nabl2/Menus.esv", was expecting "eclipse:///".
	at org.apache.commons.vfs2.provider.AbstractFileSystem.resolveFile(AbstractFileSystem.java:324) ~[commons-vfs2-2.1.jar:2.1]
	at org.apache.commons.vfs2.provider.AbstractFileSystem.resolveFile(AbstractFileSystem.java:317) ~[commons-vfs2-2.1.jar:2.1]
	at org.apache.commons.vfs2.provider.AbstractFileObject.resolveFile(AbstractFileObject.java:2024) ~[commons-vfs2-2.1.jar:2.1]
	at org.metaborg.core.resource.ResourceService.resolve(ResourceService.java:117) ~[org.metaborg.core_2.1.0.20160914-142021-master.jar:na]
	... 73 common frames omitted
18:30 | ERROR | .m.s.m.c.b.LanguageSpecBuilder - EXCEPTION in /icedust2/editor/Main.esv
18:30 | ERROR | .m.s.m.c.b.LanguageSpecBuilder - Transformation failed unexpectedly for eclipse:///icedust2/editor/Main.esv
18:30 | ERROR | .m.s.m.c.b.LanguageSpecBuilder - 	Caused by:
18:30 | ERROR | .m.s.m.c.b.LanguageSpecBuilder - org.metaborg.core.transform.TransformException: Invoking Stratego strategy failed unexpectedly:
18:30 | ERROR | .m.s.m.c.b.LanguageSpecBuilder - Stratego trace:
18:30 | ERROR | .m.s.m.c.b.LanguageSpecBuilder - 	pack_main_descriptor_file_0_0
18:30 | ERROR | .m.s.m.c.b.LanguageSpecBuilder - 	pack_main_descriptor_file_0_0
18:30 | ERROR | .m.s.m.c.b.LanguageSpecBuilder - 	create_packed_descriptor_1_0
18:30 | ERROR | .m.s.m.c.b.LanguageSpecBuilder - 	Module_3_0
18:30 | ERROR | .m.s.m.c.b.LanguageSpecBuilder - 	read_definitions_0_0
18:30 | ERROR | .m.s.m.c.b.LanguageSpecBuilder - 	map_1_0
18:30 | ERROR | .m.s.m.c.b.LanguageSpecBuilder - 	read_definitions_0_0
18:30 | ERROR | .m.s.m.c.b.LanguageSpecBuilder - 	map_1_0
18:30 | ERROR | .m.s.m.c.b.LanguageSpecBuilder - 	read_descriptor_file_0_0
18:30 | ERROR | .m.s.m.c.b.LanguageSpecBuilder - 	find_descriptor_file_0_0
18:30 | ERROR | .m.s.m.c.b.LanguageSpecBuilder - 	resolve_in_path_0_1
18:30 | ERROR | .m.s.m.c.b.LanguageSpecBuilder - 	getfirst_1_0
18:30 | ERROR | .m.s.m.c.b.LanguageSpecBuilder - 	file_exists_0_0
18:30 | ERROR | .m.s.m.c.b.LanguageSpecBuilder - 
18:30 | ERROR | .m.s.m.c.b.LanguageSpecBuilder - 	at org.metaborg.spoofax.core.transform.StrategoTransformer.transform(StrategoTransformer.java:140)
18:30 | ERROR | .m.s.m.c.b.LanguageSpecBuilder - 	at org.metaborg.spoofax.core.transform.StrategoTransformer.transform(StrategoTransformer.java:76)
18:30 | ERROR | .m.s.m.c.b.LanguageSpecBuilder - 	at org.metaborg.spoofax.core.transform.StrategoTransformer.transform(StrategoTransformer.java:1)
18:30 | ERROR | .m.s.m.c.b.LanguageSpecBuilder - 	at org.metaborg.core.transform.TransformService.transform(TransformService.java:90)
18:30 | ERROR | .m.s.m.c.b.LanguageSpecBuilder - 	at org.metaborg.core.transform.TransformService.transform(TransformService.java:78)
18:30 | ERROR | .m.s.m.c.b.LanguageSpecBuilder - 	at org.metaborg.core.build.Builder.transform(Builder.java:426)
18:30 | ERROR | .m.s.m.c.b.LanguageSpecBuilder - 	at org.metaborg.core.build.Builder.updateLanguageResources(Builder.java:266)
18:30 | ERROR | .m.s.m.c.b.LanguageSpecBuilder - 	at org.metaborg.core.build.Builder.build(Builder.java:188)
18:30 | ERROR | .m.s.m.c.b.LanguageSpecBuilder - 	at org.metaborg.spoofax.eclipse.build.BuildRunnable.run(BuildRunnable.java:61)
18:30 | ERROR | .m.s.m.c.b.LanguageSpecBuilder - 	at org.eclipse.core.internal.resources.Workspace.run(Workspace.java:2240)
18:30 | ERROR | .m.s.m.c.b.LanguageSpecBuilder - 	at org.eclipse.core.internal.resources.Workspace.run(Workspace.java:2267)
18:30 | ERROR | .m.s.m.c.b.LanguageSpecBuilder - 	at org.metaborg.spoofax.eclipse.processing.RunnableTask.schedule(RunnableTask.java:45)
18:30 | ERROR | .m.s.m.c.b.LanguageSpecBuilder - 	at org.metaborg.spoofax.meta.core.build.LanguageSpecBuilder.compile(LanguageSpecBuilder.java:163)
18:30 | ERROR | .m.s.m.c.b.LanguageSpecBuilder - 	at org.metaborg.spoofax.eclipse.meta.build.CompileBuilder$1.run(CompileBuilder.java:49)
18:30 | ERROR | .m.s.m.c.b.LanguageSpecBuilder - 	at org.eclipse.core.internal.resources.Workspace.run(Workspace.java:2240)
18:30 | ERROR | .m.s.m.c.b.LanguageSpecBuilder - 	at org.eclipse.core.internal.resources.Workspace.run(Workspace.java:2267)
18:30 | ERROR | .m.s.m.c.b.LanguageSpecBuilder - 	at org.metaborg.spoofax.eclipse.meta.build.CompileBuilder.build(CompileBuilder.java:69)
18:30 | ERROR | .m.s.m.c.b.LanguageSpecBuilder - 	at org.metaborg.spoofax.eclipse.meta.build.Builder.build(Builder.java:53)
18:30 | ERROR | .m.s.m.c.b.LanguageSpecBuilder - 	at org.eclipse.core.internal.events.BuildManager$2.run(BuildManager.java:735)
18:30 | ERROR | .m.s.m.c.b.LanguageSpecBuilder - 	at org.eclipse.core.runtime.SafeRunner.run(SafeRunner.java:42)
18:30 | ERROR | .m.s.m.c.b.LanguageSpecBuilder - 	at org.eclipse.core.internal.events.BuildManager.basicBuild(BuildManager.java:206)
18:30 | ERROR | .m.s.m.c.b.LanguageSpecBuilder - 	at org.eclipse.core.internal.events.BuildManager.basicBuild(BuildManager.java:246)
18:30 | ERROR | .m.s.m.c.b.LanguageSpecBuilder - 	at org.eclipse.core.internal.events.BuildManager$1.run(BuildManager.java:301)
18:30 | ERROR | .m.s.m.c.b.LanguageSpecBuilder - 	at org.eclipse.core.runtime.SafeRunner.run(SafeRunner.java:42)
18:30 | ERROR | .m.s.m.c.b.LanguageSpecBuilder - 	at org.eclipse.core.internal.events.BuildManager.basicBuild(BuildManager.java:304)
18:30 | ERROR | .m.s.m.c.b.LanguageSpecBuilder - 	at org.eclipse.core.internal.events.BuildManager.basicBuildLoop(BuildManager.java:360)
18:30 | ERROR | .m.s.m.c.b.LanguageSpecBuilder - 	at org.eclipse.core.internal.events.BuildManager.build(BuildManager.java:383)
18:30 | ERROR | .m.s.m.c.b.LanguageSpecBuilder - 	at org.eclipse.core.internal.resources.Workspace.buildInternal(Workspace.java:487)
18:30 | ERROR | .m.s.m.c.b.LanguageSpecBuilder - 	at org.eclipse.core.internal.resources.Workspace.build(Workspace.java:406)
18:30 | ERROR | .m.s.m.c.b.LanguageSpecBuilder - 	at org.eclipse.ui.actions.BuildAction$1.runInWorkspace(BuildAction.java:285)
18:30 | ERROR | .m.s.m.c.b.LanguageSpecBuilder - 	at org.eclipse.core.internal.resources.InternalWorkspaceJob.run(InternalWorkspaceJob.java:39)
18:30 | ERROR | .m.s.m.c.b.LanguageSpecBuilder - 	at org.eclipse.core.internal.jobs.Worker.run(Worker.java:55)
18:30 | ERROR | .m.s.m.c.b.LanguageSpecBuilder - Caused by: org.spoofax.interpreter.core.InterpreterException: Exception during evaluation
18:30 | ERROR | .m.s.m.c.b.LanguageSpecBuilder - 	at org.spoofax.interpreter.core.Interpreter.evaluate(Interpreter.java:120)
18:30 | ERROR | .m.s.m.c.b.LanguageSpecBuilder - 	at org.spoofax.interpreter.core.Interpreter.invoke(Interpreter.java:82)
18:30 | ERROR | .m.s.m.c.b.LanguageSpecBuilder - 	at org.strategoxt.HybridInterpreter.invoke(HybridInterpreter.java:442)
18:30 | ERROR | .m.s.m.c.b.LanguageSpecBuilder - 	at org.metaborg.spoofax.core.stratego.StrategoCommon.invoke(StrategoCommon.java:93)
18:30 | ERROR | .m.s.m.c.b.LanguageSpecBuilder - 	at org.metaborg.spoofax.core.transform.StrategoTransformer.transform(StrategoTransformer.java:138)
18:30 | ERROR | .m.s.m.c.b.LanguageSpecBuilder - 	... 31 more
18:30 | ERROR | .m.s.m.c.b.LanguageSpecBuilder - Caused by: org.strategoxt.lang.StrategoException: Exception in execution of primitive 'SSL_access'
18:30 | ERROR | .m.s.m.c.b.LanguageSpecBuilder - 	at org.strategoxt.lang.Context.invokePrimitive(Context.java:240)
18:30 | ERROR | .m.s.m.c.b.LanguageSpecBuilder - 	at org.strategoxt.lang.Context.invokePrimitive(Context.java:216)
18:30 | ERROR | .m.s.m.c.b.LanguageSpecBuilder - 	at org.strategoxt.stratego_lib.access_0_0.invoke(access_0_0.java:28)
18:30 | ERROR | .m.s.m.c.b.LanguageSpecBuilder - 	at org.strategoxt.stratego_lib.file_exists_0_0.invoke(file_exists_0_0.java:25)
18:30 | ERROR | .m.s.m.c.b.LanguageSpecBuilder - 	at org.metaborg.meta.lang.esv.trans.lifted32.invoke(lifted32.java:52)
18:30 | ERROR | .m.s.m.c.b.LanguageSpecBuilder - 	at org.strategoxt.lang.compat.override.performance_tweaks.lifted6964.invoke(lifted6964.java:24)
18:30 | ERROR | .m.s.m.c.b.LanguageSpecBuilder - 	at org.strategoxt.lang.SRTS_one.fetchMaintainAnnos(SRTS_one.java:57)
18:30 | ERROR | .m.s.m.c.b.LanguageSpecBuilder - 	at org.strategoxt.lang.SRTS_one.fetchMaintainAnnos(SRTS_one.java:60)
18:30 | ERROR | .m.s.m.c.b.LanguageSpecBuilder - 	at org.strategoxt.lang.SRTS_one.fetchMaintainAnnos(SRTS_one.java:60)
18:30 | ERROR | .m.s.m.c.b.LanguageSpecBuilder - 	at org.strategoxt.lang.SRTS_one.fetchMaintainAnnos(SRTS_one.java:60)
18:30 | ERROR | .m.s.m.c.b.LanguageSpecBuilder - 	at org.strategoxt.lang.SRTS_one.fetchMaintainAnnos(SRTS_one.java:60)
18:30 | ERROR | .m.s.m.c.b.LanguageSpecBuilder - 	at org.strategoxt.lang.SRTS_one.invoke(SRTS_one.java:21)
18:30 | ERROR | .m.s.m.c.b.LanguageSpecBuilder - 	at org.strategoxt.lang.compat.override.performance_tweaks.getfirst_1_0_override.invoke(getfirst_1_0_override.java:27)
18:30 | ERROR | .m.s.m.c.b.LanguageSpecBuilder - 	at org.metaborg.meta.lang.esv.trans.resolve_in_path_0_1.invoke(resolve_in_path_0_1.java:39)
18:30 | ERROR | .m.s.m.c.b.LanguageSpecBuilder - 	at org.metaborg.meta.lang.esv.trans.find_descriptor_file_0_0.invoke(find_descriptor_file_0_0.java:58)
18:30 | ERROR | .m.s.m.c.b.LanguageSpecBuilder - 	at org.metaborg.meta.lang.esv.trans.read_descriptor_file_0_0.invoke(read_descriptor_file_0_0.java:36)
18:30 | ERROR | .m.s.m.c.b.LanguageSpecBuilder - 	at org.metaborg.meta.lang.esv.trans.lifted25.invoke(lifted25.java:27)
18:30 | ERROR | .m.s.m.c.b.LanguageSpecBuilder - 	at org.strategoxt.lang.SRTS_all.map(SRTS_all.java:60)
18:30 | ERROR | .m.s.m.c.b.LanguageSpecBuilder - 	at org.strategoxt.lang.SRTS_all.invoke(SRTS_all.java:21)
18:30 | ERROR | .m.s.m.c.b.LanguageSpecBuilder - 	at org.strategoxt.lang.compat.override.performance_tweaks.map_1_0_override.invoke(map_1_0_override.java:29)
18:30 | ERROR | .m.s.m.c.b.LanguageSpecBuilder - 	at org.metaborg.meta.lang.esv.trans.read_definitions_0_0.invoke(read_definitions_0_0.java:72)
18:30 | ERROR | .m.s.m.c.b.LanguageSpecBuilder - 	at org.metaborg.meta.lang.esv.trans.lifted25.invoke(lifted25.java:30)
18:30 | ERROR | .m.s.m.c.b.LanguageSpecBuilder - 	at org.strategoxt.lang.SRTS_all.mapIgnoreAnnos(SRTS_all.java:109)
18:30 | ERROR | .m.s.m.c.b.LanguageSpecBuilder - 	at org.strategoxt.lang.SRTS_all.map(SRTS_all.java:77)
18:30 | ERROR | .m.s.m.c.b.LanguageSpecBuilder - 	at org.strategoxt.lang.SRTS_all.invoke(SRTS_all.java:21)
18:30 | ERROR | .m.s.m.c.b.LanguageSpecBuilder - 	at org.strategoxt.lang.compat.override.performance_tweaks.map_1_0_override.invoke(map_1_0_override.java:29)
18:30 | ERROR | .m.s.m.c.b.LanguageSpecBuilder - 	at org.metaborg.meta.lang.esv.trans.read_definitions_0_0.invoke(read_definitions_0_0.java:72)
18:30 | ERROR | .m.s.m.c.b.LanguageSpecBuilder - 	at org.metaborg.meta.lang.esv.trans.lifted21.invoke(lifted21.java:29)
18:30 | ERROR | .m.s.m.c.b.LanguageSpecBuilder - 	at org.metaborg.meta.lang.esv.trans.$Module_3_0.invoke($Module_3_0.java:50)
18:30 | ERROR | .m.s.m.c.b.LanguageSpecBuilder - 	at org.metaborg.meta.lang.esv.trans.create_packed_descriptor_1_0.invoke(create_packed_descriptor_1_0.java:28)
18:30 | ERROR | .m.s.m.c.b.LanguageSpecBuilder - 	at org.metaborg.meta.lang.esv.trans.pack_main_descriptor_file_0_0.invoke(pack_main_descriptor_file_0_0.java:64)
18:30 | ERROR | .m.s.m.c.b.LanguageSpecBuilder - 	at org.strategoxt.lang.Strategy.invokeDynamic(Strategy.java:30)
18:30 | ERROR | .m.s.m.c.b.LanguageSpecBuilder - 	at org.strategoxt.lang.InteropSDefT.evaluate(InteropSDefT.java:192)
18:30 | ERROR | .m.s.m.c.b.LanguageSpecBuilder - 	at org.strategoxt.lang.InteropSDefT.evaluate(InteropSDefT.java:183)
18:30 | ERROR | .m.s.m.c.b.LanguageSpecBuilder - 	at org.strategoxt.lang.InteropSDefT$StrategyBody.evaluate(InteropSDefT.java:245)
18:30 | ERROR | .m.s.m.c.b.LanguageSpecBuilder - 	at org.spoofax.interpreter.core.Interpreter.evaluate(Interpreter.java:109)
18:30 | ERROR | .m.s.m.c.b.LanguageSpecBuilder - 	... 35 more
18:30 | ERROR | .m.s.m.c.b.LanguageSpecBuilder - Caused by: org.metaborg.core.MetaborgRuntimeException: org.apache.commons.vfs2.FileSystemException: Incorrect file system URI "file:///C:/" in name "file:///C:/Program Files Custom/spoofax-win32-x86_64-20160914/plugins/meta.lib.spoofax.eclipse_2.1.0.20160914-142021-master/target/unpacked/latest/editor/nabl2/Menus.esv", was expecting "eclipse:///".
18:30 | ERROR | .m.s.m.c.b.LanguageSpecBuilder - 	at org.metaborg.core.resource.ResourceService.resolve(ResourceService.java:119)
18:30 | ERROR | .m.s.m.c.b.LanguageSpecBuilder - 	at org.metaborg.spoofax.core.stratego.ResourceAgent.exists(ResourceAgent.java:384)
18:30 | ERROR | .m.s.m.c.b.LanguageSpecBuilder - 	at org.spoofax.interpreter.library.ssl.SSL_access.call(SSL_access.java:58)
18:30 | ERROR | .m.s.m.c.b.LanguageSpecBuilder - 	at org.strategoxt.lang.Context.invokePrimitive(Context.java:227)
18:30 | ERROR | .m.s.m.c.b.LanguageSpecBuilder - 	... 70 more
18:30 | ERROR | .m.s.m.c.b.LanguageSpecBuilder - Caused by: org.apache.commons.vfs2.FileSystemException: Incorrect file system URI "file:///C:/" in name "file:///C:/Program Files Custom/spoofax-win32-x86_64-20160914/plugins/meta.lib.spoofax.eclipse_2.1.0.20160914-142021-master/target/unpacked/latest/editor/nabl2/Menus.esv", was expecting "eclipse:///".
18:30 | ERROR | .m.s.m.c.b.LanguageSpecBuilder - 	at org.apache.commons.vfs2.provider.AbstractFileSystem.resolveFile(AbstractFileSystem.java:324)
18:30 | ERROR | .m.s.m.c.b.LanguageSpecBuilder - 	at org.apache.commons.vfs2.provider.AbstractFileSystem.resolveFile(AbstractFileSystem.java:317)
18:30 | ERROR | .m.s.m.c.b.LanguageSpecBuilder - 	at org.apache.commons.vfs2.provider.AbstractFileObject.resolveFile(AbstractFileObject.java:2024)
18:30 | ERROR | .m.s.m.c.b.LanguageSpecBuilder - 	at org.metaborg.core.resource.ResourceService.resolve(ResourceService.java:117)
18:30 | ERROR | .m.s.m.c.b.LanguageSpecBuilder - 	... 73 more
18:30 | ERROR | .m.s.m.c.b.LanguageSpecBuilder - 
18:30 | ERROR | .m.s.m.c.b.LanguageSpecBuilder - 
18:30 | ERROR | .m.s.m.c.b.LanguageSpecBuilder - ERROR in eclipse:///icedust2
18:30 | ERROR | .m.s.m.c.b.LanguageSpecBuilder - Transformation failed unexpectedly
18:30 | ERROR | .m.s.m.c.b.LanguageSpecBuilder - 	Caused by:
18:30 | ERROR | .m.s.m.c.b.LanguageSpecBuilder - org.metaborg.core.transform.TransformException: Invoking Stratego strategy failed unexpectedly:
18:30 | ERROR | .m.s.m.c.b.LanguageSpecBuilder - Stratego trace:
18:30 | ERROR | .m.s.m.c.b.LanguageSpecBuilder - 	pack_main_descriptor_file_0_0
18:30 | ERROR | .m.s.m.c.b.LanguageSpecBuilder - 	pack_main_descriptor_file_0_0
18:30 | ERROR | .m.s.m.c.b.LanguageSpecBuilder - 	create_packed_descriptor_1_0
18:30 | ERROR | .m.s.m.c.b.LanguageSpecBuilder - 	Module_3_0
18:30 | ERROR | .m.s.m.c.b.LanguageSpecBuilder - 	read_definitions_0_0
18:30 | ERROR | .m.s.m.c.b.LanguageSpecBuilder - 	map_1_0
18:30 | ERROR | .m.s.m.c.b.LanguageSpecBuilder - 	read_definitions_0_0
18:30 | ERROR | .m.s.m.c.b.LanguageSpecBuilder - 	map_1_0
18:30 | ERROR | .m.s.m.c.b.LanguageSpecBuilder - 	read_descriptor_file_0_0
18:30 | ERROR | .m.s.m.c.b.LanguageSpecBuilder - 	find_descriptor_file_0_0
18:30 | ERROR | .m.s.m.c.b.LanguageSpecBuilder - 	resolve_in_path_0_1
18:30 | ERROR | .m.s.m.c.b.LanguageSpecBuilder - 	getfirst_1_0
18:30 | ERROR | .m.s.m.c.b.LanguageSpecBuilder - 	file_exists_0_0
18:30 | ERROR | .m.s.m.c.b.LanguageSpecBuilder - 
18:30 | ERROR | .m.s.m.c.b.LanguageSpecBuilder - 	at org.metaborg.spoofax.core.transform.StrategoTransformer.transform(StrategoTransformer.java:140)
18:30 | ERROR | .m.s.m.c.b.LanguageSpecBuilder - 	at org.metaborg.spoofax.core.transform.StrategoTransformer.transform(StrategoTransformer.java:76)
18:30 | ERROR | .m.s.m.c.b.LanguageSpecBuilder - 	at org.metaborg.spoofax.core.transform.StrategoTransformer.transform(StrategoTransformer.java:1)
18:30 | ERROR | .m.s.m.c.b.LanguageSpecBuilder - 	at org.metaborg.core.transform.TransformService.transform(TransformService.java:90)
18:30 | ERROR | .m.s.m.c.b.LanguageSpecBuilder - 	at org.metaborg.core.transform.TransformService.transform(TransformService.java:78)
18:30 | ERROR | .m.s.m.c.b.LanguageSpecBuilder - 	at org.metaborg.core.build.Builder.transform(Builder.java:426)
18:30 | ERROR | .m.s.m.c.b.LanguageSpecBuilder - 	at org.metaborg.core.build.Builder.updateLanguageResources(Builder.java:266)
18:30 | ERROR | .m.s.m.c.b.LanguageSpecBuilder - 	at org.metaborg.core.build.Builder.build(Builder.java:188)
18:30 | ERROR | .m.s.m.c.b.LanguageSpecBuilder - 	at org.metaborg.spoofax.eclipse.build.BuildRunnable.run(BuildRunnable.java:61)
18:30 | ERROR | .m.s.m.c.b.LanguageSpecBuilder - 	at org.eclipse.core.internal.resources.Workspace.run(Workspace.java:2240)
18:30 | ERROR | .m.s.m.c.b.LanguageSpecBuilder - 	at org.eclipse.core.internal.resources.Workspace.run(Workspace.java:2267)
18:30 | ERROR | .m.s.m.c.b.LanguageSpecBuilder - 	at org.metaborg.spoofax.eclipse.processing.RunnableTask.schedule(RunnableTask.java:45)
18:30 | ERROR | .m.s.m.c.b.LanguageSpecBuilder - 	at org.metaborg.spoofax.meta.core.build.LanguageSpecBuilder.compile(LanguageSpecBuilder.java:163)
18:30 | ERROR | .m.s.m.c.b.LanguageSpecBuilder - 	at org.metaborg.spoofax.eclipse.meta.build.CompileBuilder$1.run(CompileBuilder.java:49)
18:30 | ERROR | .m.s.m.c.b.LanguageSpecBuilder - 	at org.eclipse.core.internal.resources.Workspace.run(Workspace.java:2240)
18:30 | ERROR | .m.s.m.c.b.LanguageSpecBuilder - 	at org.eclipse.core.internal.resources.Workspace.run(Workspace.java:2267)
18:30 | ERROR | .m.s.m.c.b.LanguageSpecBuilder - 	at org.metaborg.spoofax.eclipse.meta.build.CompileBuilder.build(CompileBuilder.java:69)
18:30 | ERROR | .m.s.m.c.b.LanguageSpecBuilder - 	at org.metaborg.spoofax.eclipse.meta.build.Builder.build(Builder.java:53)
18:30 | ERROR | .m.s.m.c.b.LanguageSpecBuilder - 	at org.eclipse.core.internal.events.BuildManager$2.run(BuildManager.java:735)
18:30 | ERROR | .m.s.m.c.b.LanguageSpecBuilder - 	at org.eclipse.core.runtime.SafeRunner.run(SafeRunner.java:42)
18:30 | ERROR | .m.s.m.c.b.LanguageSpecBuilder - 	at org.eclipse.core.internal.events.BuildManager.basicBuild(BuildManager.java:206)
18:30 | ERROR | .m.s.m.c.b.LanguageSpecBuilder - 	at org.eclipse.core.internal.events.BuildManager.basicBuild(BuildManager.java:246)
18:30 | ERROR | .m.s.m.c.b.LanguageSpecBuilder - 	at org.eclipse.core.internal.events.BuildManager$1.run(BuildManager.java:301)
18:30 | ERROR | .m.s.m.c.b.LanguageSpecBuilder - 	at org.eclipse.core.runtime.SafeRunner.run(SafeRunner.java:42)
18:30 | ERROR | .m.s.m.c.b.LanguageSpecBuilder - 	at org.eclipse.core.internal.events.BuildManager.basicBuild(BuildManager.java:304)
18:30 | ERROR | .m.s.m.c.b.LanguageSpecBuilder - 	at org.eclipse.core.internal.events.BuildManager.basicBuildLoop(BuildManager.java:360)
18:30 | ERROR | .m.s.m.c.b.LanguageSpecBuilder - 	at org.eclipse.core.internal.events.BuildManager.build(BuildManager.java:383)
18:30 | ERROR | .m.s.m.c.b.LanguageSpecBuilder - 	at org.eclipse.core.internal.resources.Workspace.buildInternal(Workspace.java:487)
18:30 | ERROR | .m.s.m.c.b.LanguageSpecBuilder - 	at org.eclipse.core.internal.resources.Workspace.build(Workspace.java:406)
18:30 | ERROR | .m.s.m.c.b.LanguageSpecBuilder - 	at org.eclipse.ui.actions.BuildAction$1.runInWorkspace(BuildAction.java:285)
18:30 | ERROR | .m.s.m.c.b.LanguageSpecBuilder - 	at org.eclipse.core.internal.resources.InternalWorkspaceJob.run(InternalWorkspaceJob.java:39)
18:30 | ERROR | .m.s.m.c.b.LanguageSpecBuilder - 	at org.eclipse.core.internal.jobs.Worker.run(Worker.java:55)
18:30 | ERROR | .m.s.m.c.b.LanguageSpecBuilder - Caused by: org.spoofax.interpreter.core.InterpreterException: Exception during evaluation
18:30 | ERROR | .m.s.m.c.b.LanguageSpecBuilder - 	at org.spoofax.interpreter.core.Interpreter.evaluate(Interpreter.java:120)
18:30 | ERROR | .m.s.m.c.b.LanguageSpecBuilder - 	at org.spoofax.interpreter.core.Interpreter.invoke(Interpreter.java:82)
18:30 | ERROR | .m.s.m.c.b.LanguageSpecBuilder - 	at org.strategoxt.HybridInterpreter.invoke(HybridInterpreter.java:442)
18:30 | ERROR | .m.s.m.c.b.LanguageSpecBuilder - 	at org.metaborg.spoofax.core.stratego.StrategoCommon.invoke(StrategoCommon.java:93)
18:30 | ERROR | .m.s.m.c.b.LanguageSpecBuilder - 	at org.metaborg.spoofax.core.transform.StrategoTransformer.transform(StrategoTransformer.java:138)
18:30 | ERROR | .m.s.m.c.b.LanguageSpecBuilder - 	... 31 more
18:30 | ERROR | .m.s.m.c.b.LanguageSpecBuilder - Caused by: org.strategoxt.lang.StrategoException: Exception in execution of primitive 'SSL_access'
18:30 | ERROR | .m.s.m.c.b.LanguageSpecBuilder - 	at org.strategoxt.lang.Context.invokePrimitive(Context.java:240)
18:30 | ERROR | .m.s.m.c.b.LanguageSpecBuilder - 	at org.strategoxt.lang.Context.invokePrimitive(Context.java:216)
18:30 | ERROR | .m.s.m.c.b.LanguageSpecBuilder - 	at org.strategoxt.stratego_lib.access_0_0.invoke(access_0_0.java:28)
18:30 | ERROR | .m.s.m.c.b.LanguageSpecBuilder - 	at org.strategoxt.stratego_lib.file_exists_0_0.invoke(file_exists_0_0.java:25)
18:30 | ERROR | .m.s.m.c.b.LanguageSpecBuilder - 	at org.metaborg.meta.lang.esv.trans.lifted32.invoke(lifted32.java:52)
18:30 | ERROR | .m.s.m.c.b.LanguageSpecBuilder - 	at org.strategoxt.lang.compat.override.performance_tweaks.lifted6964.invoke(lifted6964.java:24)
18:30 | ERROR | .m.s.m.c.b.LanguageSpecBuilder - 	at org.strategoxt.lang.SRTS_one.fetchMaintainAnnos(SRTS_one.java:57)
18:30 | ERROR | .m.s.m.c.b.LanguageSpecBuilder - 	at org.strategoxt.lang.SRTS_one.fetchMaintainAnnos(SRTS_one.java:60)
18:30 | ERROR | .m.s.m.c.b.LanguageSpecBuilder - 	at org.strategoxt.lang.SRTS_one.fetchMaintainAnnos(SRTS_one.java:60)
18:30 | ERROR | .m.s.m.c.b.LanguageSpecBuilder - 	at org.strategoxt.lang.SRTS_one.fetchMaintainAnnos(SRTS_one.java:60)
18:30 | ERROR | .m.s.m.c.b.LanguageSpecBuilder - 	at org.strategoxt.lang.SRTS_one.fetchMaintainAnnos(SRTS_one.java:60)
18:30 | ERROR | .m.s.m.c.b.LanguageSpecBuilder - 	at org.strategoxt.lang.SRTS_one.invoke(SRTS_one.java:21)
18:30 | ERROR | .m.s.m.c.b.LanguageSpecBuilder - 	at org.strategoxt.lang.compat.override.performance_tweaks.getfirst_1_0_override.invoke(getfirst_1_0_override.java:27)
18:30 | ERROR | .m.s.m.c.b.LanguageSpecBuilder - 	at org.metaborg.meta.lang.esv.trans.resolve_in_path_0_1.invoke(resolve_in_path_0_1.java:39)
18:30 | ERROR | .m.s.m.c.b.LanguageSpecBuilder - 	at org.metaborg.meta.lang.esv.trans.find_descriptor_file_0_0.invoke(find_descriptor_file_0_0.java:58)
18:30 | ERROR | .m.s.m.c.b.LanguageSpecBuilder - 	at org.metaborg.meta.lang.esv.trans.read_descriptor_file_0_0.invoke(read_descriptor_file_0_0.java:36)
18:30 | ERROR | .m.s.m.c.b.LanguageSpecBuilder - 	at org.metaborg.meta.lang.esv.trans.lifted25.invoke(lifted25.java:27)
18:30 | ERROR | .m.s.m.c.b.LanguageSpecBuilder - 	at org.strategoxt.lang.SRTS_all.map(SRTS_all.java:60)
18:30 | ERROR | .m.s.m.c.b.LanguageSpecBuilder - 	at org.strategoxt.lang.SRTS_all.invoke(SRTS_all.java:21)
18:30 | ERROR | .m.s.m.c.b.LanguageSpecBuilder - 	at org.strategoxt.lang.compat.override.performance_tweaks.map_1_0_override.invoke(map_1_0_override.java:29)
18:30 | ERROR | .m.s.m.c.b.LanguageSpecBuilder - 	at org.metaborg.meta.lang.esv.trans.read_definitions_0_0.invoke(read_definitions_0_0.java:72)
18:30 | ERROR | .m.s.m.c.b.LanguageSpecBuilder - 	at org.metaborg.meta.lang.esv.trans.lifted25.invoke(lifted25.java:30)
18:30 | ERROR | .m.s.m.c.b.LanguageSpecBuilder - 	at org.strategoxt.lang.SRTS_all.mapIgnoreAnnos(SRTS_all.java:109)
18:30 | ERROR | .m.s.m.c.b.LanguageSpecBuilder - 	at org.strategoxt.lang.SRTS_all.map(SRTS_all.java:77)
18:30 | ERROR | .m.s.m.c.b.LanguageSpecBuilder - 	at org.strategoxt.lang.SRTS_all.invoke(SRTS_all.java:21)
18:30 | ERROR | .m.s.m.c.b.LanguageSpecBuilder - 	at org.strategoxt.lang.compat.override.performance_tweaks.map_1_0_override.invoke(map_1_0_override.java:29)
18:30 | ERROR | .m.s.m.c.b.LanguageSpecBuilder - 	at org.metaborg.meta.lang.esv.trans.read_definitions_0_0.invoke(read_definitions_0_0.java:72)
18:30 | ERROR | .m.s.m.c.b.LanguageSpecBuilder - 	at org.metaborg.meta.lang.esv.trans.lifted21.invoke(lifted21.java:29)
18:30 | ERROR | .m.s.m.c.b.LanguageSpecBuilder - 	at org.metaborg.meta.lang.esv.trans.$Module_3_0.invoke($Module_3_0.java:50)
18:30 | ERROR | .m.s.m.c.b.LanguageSpecBuilder - 	at org.metaborg.meta.lang.esv.trans.create_packed_descriptor_1_0.invoke(create_packed_descriptor_1_0.java:28)
18:30 | ERROR | .m.s.m.c.b.LanguageSpecBuilder - 	at org.metaborg.meta.lang.esv.trans.pack_main_descriptor_file_0_0.invoke(pack_main_descriptor_file_0_0.java:64)
18:30 | ERROR | .m.s.m.c.b.LanguageSpecBuilder - 	at org.strategoxt.lang.Strategy.invokeDynamic(Strategy.java:30)
18:30 | ERROR | .m.s.m.c.b.LanguageSpecBuilder - 	at org.strategoxt.lang.InteropSDefT.evaluate(InteropSDefT.java:192)
18:30 | ERROR | .m.s.m.c.b.LanguageSpecBuilder - 	at org.strategoxt.lang.InteropSDefT.evaluate(InteropSDefT.java:183)
18:30 | ERROR | .m.s.m.c.b.LanguageSpecBuilder - 	at org.strategoxt.lang.InteropSDefT$StrategyBody.evaluate(InteropSDefT.java:245)
18:30 | ERROR | .m.s.m.c.b.LanguageSpecBuilder - 	at org.spoofax.interpreter.core.Interpreter.evaluate(Interpreter.java:109)
18:30 | ERROR | .m.s.m.c.b.LanguageSpecBuilder - 	... 35 more
18:30 | ERROR | .m.s.m.c.b.LanguageSpecBuilder - Caused by: org.metaborg.core.MetaborgRuntimeException: org.apache.commons.vfs2.FileSystemException: Incorrect file system URI "file:///C:/" in name "file:///C:/Program Files Custom/spoofax-win32-x86_64-20160914/plugins/meta.lib.spoofax.eclipse_2.1.0.20160914-142021-master/target/unpacked/latest/editor/nabl2/Menus.esv", was expecting "eclipse:///".
18:30 | ERROR | .m.s.m.c.b.LanguageSpecBuilder - 	at org.metaborg.core.resource.ResourceService.resolve(ResourceService.java:119)
18:30 | ERROR | .m.s.m.c.b.LanguageSpecBuilder - 	at org.metaborg.spoofax.core.stratego.ResourceAgent.exists(ResourceAgent.java:384)
18:30 | ERROR | .m.s.m.c.b.LanguageSpecBuilder - 	at org.spoofax.interpreter.library.ssl.SSL_access.call(SSL_access.java:58)
18:30 | ERROR | .m.s.m.c.b.LanguageSpecBuilder - 	at org.strategoxt.lang.Context.invokePrimitive(Context.java:227)
18:30 | ERROR | .m.s.m.c.b.LanguageSpecBuilder - 	... 70 more
18:30 | ERROR | .m.s.m.c.b.LanguageSpecBuilder - Caused by: org.apache.commons.vfs2.FileSystemException: Incorrect file system URI "file:///C:/" in name "file:///C:/Program Files Custom/spoofax-win32-x86_64-20160914/plugins/meta.lib.spoofax.eclipse_2.1.0.20160914-142021-master/target/unpacked/latest/editor/nabl2/Menus.esv", was expecting "eclipse:///".
18:30 | ERROR | .m.s.m.c.b.LanguageSpecBuilder - 	at org.apache.commons.vfs2.provider.AbstractFileSystem.resolveFile(AbstractFileSystem.java:324)
18:30 | ERROR | .m.s.m.c.b.LanguageSpecBuilder - 	at org.apache.commons.vfs2.provider.AbstractFileSystem.resolveFile(AbstractFileSystem.java:317)
18:30 | ERROR | .m.s.m.c.b.LanguageSpecBuilder - 	at org.apache.commons.vfs2.provider.AbstractFileObject.resolveFile(AbstractFileObject.java:2024)
18:30 | ERROR | .m.s.m.c.b.LanguageSpecBuilder - 	at org.metaborg.core.resource.ResourceService.resolve(ResourceService.java:117)
18:30 | ERROR | .m.s.m.c.b.LanguageSpecBuilder - 	... 73 more
18:30 | ERROR | .m.s.m.c.b.LanguageSpecBuilder - 
18:30 | ERROR | .m.s.m.c.b.LanguageSpecBuilder - 
18:30 | INFO  | .m.s.m.c.b.LanguageSpecBuilder - 2 messages (1 exception, 1 error, 0 warnings, 0 notes)
18:30 | ERROR | o.m.s.e.m.b.CompileBuilder     - Compiling Main ESV file failed
18:30 | ERROR | o.m.s.e.m.b.CompileBuilder     - BUILD FAILED

On 14 September 2016 at 18:41 Daco Harkes commented:

P.S. NaBL1 project does build, it is the NaBL2 project that doesn't build.


On 19 September 2016 at 09:03 Gabriël Konat commented:

First of all, you should not unpack Spoofax into program files because you do not have write access there (RTFM: http://spoofax.readthedocs.io/en/latest/source/langdev/start.html#unpack)

Second, the issue might be caused by a space in the path, can you try a path without spaces?


On 19 September 2016 at 09:14 Daco Harkes commented:

First of all, its not in program files, rtf stack-trace.

Second, I'll try that.


On 19 September 2016 at 09:15 Gabriël Konat commented:

"Program Files Custom" -_-


On 19 September 2016 at 09:26 Daco Harkes commented:

Yep, its the space in the path:

C:\Program Files Custom\spoofax-win32-x86_64-20160914-2
->
Caused by: org.apache.commons.vfs2.FileSystemException: Incorrect file system URI "file:///C:/" in name "file:///C:/Program Files Custom/spoofax-win32-x86_64-20160914-2/plugins/meta.lib.spoofax.eclipse_2.1.0.20160914-170556-master/target/unpacked/latest/editor/nabl2/Menus.esv", was expecting "eclipse:///".

C:\Users\Daco\Desktop\spoofax-win32-x86_64-20160914-2 works fine.


On 11 October 2016 at 09:46 Gabriël Konat commented:

Should be fixed in the latest development version.


On 11 October 2016 at 09:46 Gabriël Konat closed this issue.

Log in to post comments